{"text_format":"1","workbook":"xlsx","n_sheets":10,"sheets":["サービス名称の変更について","留意事項","基本情報","IPoE申込情報","付加サービス情報","OCNメールアカウント情報","list","変換","OCNメニュー","改版履歴"],"not_rendered":{"charts":0,"images":1,"macros":1,"external_links":0,"defined_names":220,"comments":0,"pivot_tables":0},"unopened":[],"bounds":{"document_bytes":16777216,"sheet_cells":100000,"rows_first":2000,"rows_last":500,"rows_between":2000,"halvings":0,"cell_chars":16384,"cell_head_chars":4096},"cells_cut":0,"cells_raw":0,"read":"whole","date_system":"1900"}

{"sheet":"サービス名称の変更について","index":0,"n_rows":35,"n_cols":36,"rows_kept":35,"cut":false,"hidden":false,"merged":[[34,0,34,16],[34,17,34,20],[34,21,34,24],[34,25,34,32],[34,33,34,40],[25,29,25,34],[30,0,33,16],[30,17,31,20],[30,21,30,24],[30,25,30,32],[30,33,30,40],[31,21,31,24],[31,25,31,32],[31,33,31,40],[32,17,33,20],[32,21,32,24],[32,25,32,32],[32,33,32,40],[33,21,33,24],[33,25,33,32],[33,33,33,40],[26,35,26,40],[29,0,29,16],[29,17,29,20],[29,21,29,24],[29,25,29,32],[29,33,29,40],[23,0,26,7],[23,8,23,16],[23,17,23,22],[23,23,23,28],[23,29,23,34],[26,8,26,16],[26,17,26,22],[26,23,26,28],[26,29,26,34],[25,8,25,16],[25,35,25,40],[18,0,18,40],[21,0,22,16],[21,17,21,40],[22,17,22,22],[22,23,22,28],[22,29,22,34],[22,35,22,40],[23,35,23,40],[24,8,24,16],[24,17,24,22],[24,23,24,28],[24,29,24,34],[24,35,24,40],[25,17,25,22],[25,23,25,28],[15,0,15,19],[15,20,15,40],[9,0,9,19],[9,20,9,40],[10,0,10,19],[10,20,10,40],[11,0,11,19],[11,20,11,40],[12,0,12,40],[13,0,13,19],[13,20,13,40],[14,0,14,19],[14,20,14,40],[0,0,1,40],[3,0,3,40],[7,0,7,19],[7,20,7,40],[8,0,8,19],[8,20,8,40]]}
["●サービス名称の変更について（重要）"]
[]
[]
["・2012年9月30日をもって、第６種OCNフレッツ光サービスプランの名称を変更いたしました。変更内容については、下表をご確認ください。"]
["・本契約申込書では、一部旧サービス名称で記載されております。下記の対応表にしたがって読み替えを行ってください。"]
["・サービス名称の変更に伴う契約約款の変更はございません。"]
[]
["2012年9月30日以前のサービス名称",null,null,null,null,null,null,null,null,null,null,null,null,null,null,null,null,null,null,null,"2012年10月1日以降のサービス名称"]
{"$rows_left_out":28}
{"sheet":"留意事項","index":1,"n_rows":130,"n_cols":43,"rows_kept":130,"cut":false,"hidden":false,"merged":[[1,0,1,43],[2,0,2,43],[4,0,4,43],[7,1,7,35],[7,38,7,41],[7,42,7,43],[8,18,8,35],[8,36,9,37],[8,38,9,41],[8,42,9,43],[9,18,9,35],[10,18,10,35],[10,36,12,37],[10,38,12,41],[10,42,12,43],[11,18,11,35],[17,18,17,35],[17,36,17,37],[17,38,17,41],[17,42,17,43],[18,18,18,35],[18,36,18,37],[18,38,18,41],[18,42,18,43],[13,18,13,35],[13,36,15,37],[13,38,15,41],[13,42,15,43],[16,36,16,37],[16,38,16,41],[16,42,16,43],[25,36,26,37],[25,38,26,41],[25,42,26,43],[27,36,29,37],[27,38,29,41],[27,42,29,43],[19,18,19,35],[19,36,19,37],[19,38,19,41],[19,42,19,43],[20,36,24,37],[20,38,24,41],[20,42,24,43],[23,18,23,35],[24,18,24,35],[30,18,30,35],[30,36,31,37],[30,38,31,41],[30,42,31,43],[32,18,32,35],[32,36,33,37],[32,38,33,41],[32,42,33,43],[33,18,33,35],[39,36,39,37],[39,38,39,41],[39,42,39,43],[40,36,40,37],[40,38,40,41],[40,42,40,43],[34,18,34,35],[34,36,36,37],[34,38,36,41],[34,42,36,43],[35,18,35,35],[37,18,37,35],[37,36,38,37],[37,38,38,41],[37,42,38,43],[41,18,41,35],[41,36,41,37],[41,38,41,41],[41,42,41,43],[42,36,45,37],[42,38,45,41],[42,42,45,43],[44,18,44,35],[45,18,45,35],[50,36,52,37],[50,38,52,41],[50,42,52,43],[53,1,53,43],[72,0,72,45],[46,36,47,37],[46,38,47,41],[46,42,47,43],[48,36,49,37],[48,38,49,41],[48,42,49,43],[88,22,88,27],[88,28,88,42],[89,28,89,42],[90,28,90,42],[73,0,73,45],[74,0,74,45],[64,0,64,43],[75,0,75,43],[76,0,76,43],[77,0,77,43],[82,1,82,5],[81,22,81,27],[81,28,81,42],[82,28,82,42],[83,28,83,42],[84,28,84,42],[85,28,85,42],[86,28,86,42],[87,28,87,42],[82,22,82,27],[86,1,86,5],[107,0,107,43],[116,0,116,43],[120,1,120,43],[91,28,91,42],[92,28,92,42],[93,28,93,42],[94,28,94,42],[95,28,95,42],[96,28,96,42],[91,22,91,27]]}
[]
[{"$f":"基本情報!A5","v":"第６種オープンコンピュータ通信網サービス　IP1/forVPN/動的IP　契約申込書（新規）"}]
["申し込みにあたって、必ずお読みください"]
[]
["OCNサービスは（以下、「本サービス」）は当社の定める「IP通信網サービス契約約款」に基づき提供させて頂いております。\n本サービスの申込みにつきましては「IP通信網サービス契約約款」、各種利用規約、及び「重要事項に関する説明」「個人情報取り扱い」の内容を事前にお読みいただき、承諾された上で、お申込みください。契約約款は弊社各支店、営業窓口及びホームページで公開しておりますが、詳細な内容につきましては弊社販売担当者等にご確認ください。「個人情報取り扱い」の内容に関してはホームページ（https://www.ntt.com/about-us/hp/privacy.html）にて公開しております。　　\n\n本申込書はOCN第６種 固定IP1及び、for VPNの契約申込書となります。\nサービスの詳細につきましてはOCNサービスのホームページ（http://www.ntt.com/business/services/network/internet-connect/ocn-business.html）で必ずご確認下さい。"]
[]
[null,"＜アクセスライン別対応表＞"]
[null,"サービスタイプ",null,null,null,null,null,null,null,null,null,null,null,null,null,null,null,null,null,null,null,null,null,null,null,null,null,null,null,null,null,null,null,null,null,null,"新設",null,"アクセスプラン変更",null,null,null,"移転"]
{"$rows_left_out":123}
{"sheet":"基本情報","index":2,"n_rows":118,"n_cols":61,"rows_kept":118,"cut":false,"hidden":false,"merged":[[89,8,89,12],[89,13,89,32],[88,13,88,32],[83,0,91,5],[89,33,89,51],[80,0,80,51],[104,0,104,51],[112,0,112,51],[5,1,6,51],[7,1,7,51],[25,6,25,12],[23,6,23,12],[24,6,24,12],[26,6,26,12],[23,0,26,5],[61,6,61,12],[63,6,63,12],[59,6,59,12],[60,6,60,12],[62,6,62,12],[59,0,63,5],[47,0,47,51],[88,33,88,51],[90,13,90,32],[91,8,91,12],[90,8,90,12],[100,33,100,51],[93,0,93,12],[93,13,93,51],[97,0,97,12],[97,13,97,32],[97,33,97,51],[98,0,98,12],[98,13,98,32],[98,33,98,51],[99,0,99,12],[99,13,99,32],[99,33,99,51],[94,0,94,12],[94,13,94,51],[90,33,90,51],[91,13,91,32],[91,33,91,51],[100,0,100,12],[100,13,100,32],[83,33,83,51],[84,33,84,51],[85,13,85,40],[85,41,85,51],[86,13,86,32],[86,33,86,51],[87,13,87,32],[87,33,87,51],[84,6,84,12],[85,6,85,12],[86,6,86,12],[87,6,87,12],[83,13,83,32],[84,13,84,32],[83,6,83,12],[79,0,79,51],[81,0,82,5],[82,6,82,12],[81,6,81,12],[81,13,81,32],[81,33,81,51],[82,13,82,32],[82,33,82,51],[70,0,78,5],[70,13,70,32],[70,33,70,51],[70,6,70,12],[72,6,72,12],[72,13,72,40],[72,41,72,51],[73,6,73,12],[73,13,73,32],[78,33,78,51],[73,33,73,51],[74,6,74,12],[74,13,74,32],[74,33,74,51],[75,6,75,12],[75,13,75,32],[75,33,75,51],[76,6,76,12],[76,13,76,32],[76,33,76,51],[77,33,77,51],[77,6,78,7],[77,13,77,32],[78,13,78,32],[78,8,78,12],[77,8,77,12],[63,33,63,51],[66,0,66,51],[68,0,68,12],[68,13,68,32],[68,33,68,51],[69,0,69,12],[69,13,69,32],[69,33,69,51],[71,6,71,12],[71,13,71,32],[71,33,71,51],[67,0,67,51],[34,0,34,12],[34,13,34,32],[64,0,64,51],[65,0,65,12],[65,13,65,32],[65,33,65,51],[46,0,46,51],[63,13,63,32],[48,0,54,5],[49,6,49,12],[50,6,50,12],[51,6,51,12],[52,6,52,12],[48,6,48,12],[54,6,54,12],[53,6,53,12],[55,0,57,5],[55,6,55,12],[56,6,56,12],[57,6,57,12],[48,13,48,32],[49,13,49,32],[50,13,50,40],[56,33,56,51],[62,33,62,51],[51,13,51,32],[52,13,52,32],[53,13,53,32],[54,13,54,32],[55,13,55,32],[56,13,56,32],[57,13,57,32],[60,13,60,32],[60,33,60,51],[61,13,61,32],[61,33,61,51],[55,33,55,51],[52,33,52,51],[53,33,53,51],[54,33,54,51],[59,33,59,51],[33,33,33,51],[33,0,33,12],[21,13,21,32],[21,33,21,51],[30,13,30,32],[29,0,29,51],[16,43,16,51],[25,13,25,32],[25,33,25,51],[32,0,32,12],[32,13,32,32],[44,0,45,5],[36,13,36,32],[36,33,36,51],[38,13,38,32],[38,33,38,51],[38,0,38,12],[43,0,43,51],[41,6,41,12],[40,6,40,12],[40,13,40,32],[40,33,40,51],[36,0,36,12],[41,13,41,32],[41,33,41,51],[45,13,45,32],[45,33,45,51],[37,0,37,51],[39,0,39,51],[44,6,44,12],[45,6,45,12],[44,13,44,32],[44,33,44,51],[13,13,13,32],[13,33,13,51],[12,0,12,51],[14,0,14,5],[15,0,15,12],[15,13,15,38],[16,0,16,12],[40,0,41,5],[42,0,42,12],[42,13,42,32],[42,33,42,51],[34,33,34,51],[35,0,35,51],[16,13,16,38],[22,0,22,51],[30,0,30,12],[26,13,26,32],[26,33,26,51],[30,33,30,51],[17,0,17,5],[28,0,28,51],[31,0,31,12],[32,33,32,51],[33,13,33,32],[2,28,2,31],[2,32,2,39],[2,40,2,43],[2,44,2,51],[9,33,9,51],[9,13,9,32],[31,13,31,32],[31,33,31,51],[24,13,24,32],[24,33,24,51],[10,33,10,51],[11,13,11,32],[11,33,11,51],[15,39,16,42],[14,6,14,51],[23,13,23,32],[10,0,10,12],[15,43,15,51],[17,6,17,51],[21,6,21,12],[20,6,20,12],[19,6,19,12],[18,6,18,12],[18,0,21,5],[9,0,9,12],[11,0,11,12],[23,33,23,51],[10,13,10,32],[4,0,4,51],[96,0,96,51],[101,0,101,12],[101,13,101,32],[101,33,101,51],[62,13,62,32],[48,33,48,51],[49,33,49,51],[50,41,50,51],[51,33,51,51],[57,33,57,51],[58,0,58,51],[59,13,59,32],[18,13,18,32],[18,33,18,51],[19,13,19,40],[19,41,19,51],[20,13,20,32],[20,33,20,51],[13,0,13,12],[102,0,102,12],[102,13,102,32],[88,6,91,7],[102,33,102,51],[105,6,105,12],[105,13,105,32],[105,33,105,51],[105,0,111,5],[92,0,92,51],[111,6,111,12],[111,13,111,32],[111,33,111,51],[109,6,109,12],[109,13,109,32],[106,6,106,12],[106,13,106,32],[106,33,106,51],[107,6,107,12],[107,13,107,32],[88,8,88,12],[110,13,110,32],[110,33,110,51],[107,33,107,51],[109,33,109,51],[108,33,108,51],[108,6,108,12],[108,13,108,32],[113,0,117,5],[113,6,113,12],[113,13,113,32],[113,33,113,51],[114,6,114,12],[114,13,114,32],[114,33,114,51],[115,6,115,12],[115,13,115,32],[115,33,115,51],[116,6,116,12],[116,13,116,32],[116,33,116,51],[117,6,117,12],[117,13,117,32],[117,33,117,51],[110,6,110,12]]}
[null,null,null,null,null,null,null,null,null,null,null,null,null,null,null,null,null,null,null,null,null,null,null,null,null,null,null,null,null,null,null,null,null,null,null,null,null,null,null,null,null,null,null,null,null,null,null,null,null,null,null,{"$f":"CONCATENATE($BC$1,$BD$1,$BE$1,$BF$1)","v":"Ver.1.02B(2020/11/30)"},null,null,"Ver.","1.02","B","(2020/11/30)"]
[null,null,null,null,null,null,null,null,null,null,null,null,null,null,null,null,null,null,null,null,null,null,null,null,null,null,null,null,null,null,null,null,null,null,null,null,null,null,null,null,null,null,null,null,null,null,null,null,null,null,null,null,null,null,"サービス","forVPN/動的IP",{"$f":"IF($BD$2=\"forVPNライト\",1,IF($BD$2=\"IP1/forVPN\",2,IF($BD$2=\"IP8以上\",3,2)))","v":2}]
[null,null,null,null,null,null,null,null,null,null,null,null,null,null,null,null,null,null,null,null,null,null,null,null,null,null,null,null,"オーダ管理番号",null,null,null,null,null,null,null,null,null,null,null,"オーダ登録番号",null,null,null,null,null,null,null,null,null,null,null,null,null,"異動種別","新設","-"]
[]
["第６種オープンコンピュータ通信網サービス　IP1/forVPN/動的IP　契約申込書（新規）"]
["レ","NTTコミュニケーションズ株式会社の定める｢IP通信網サービス契約約款（https://www.ntt.com/about-us/disclosure/tariff/yakkan/ip.html）｣｢重要事項に関する説明｣｢各種利用規約｣｢お申込みに関する注意事項｣の内容について承諾の上、下記のとおり申し込みます｡個人情報の取扱いについては、「プライバシーポリシー（https://www.ntt.com/about-us/hp/privacy.html）」の内容を承諾します。",null,null,null,null,null,null,null,null,null,null,null,null,null,null,null,null,null,null,null,null,null,null,null,null,null,null,null,null,null,null,null,null,null,null,null,null,null,null,null,null,null,null,null,null,null,null,null,null,null,null,null,null,"アクセスタイプ：(F)","アクセスタイプ：光コラボ","回線が光ネクスト","フレッツ・ISDN","forVPN/動的IP\nかつ光コラボ","IPoEメニュー","動的IP(ex)かつ光コラボ"]
[null,null,null,null,null,null,null,null,null,null,null,null,null,null,null,null,null,null,null,null,null,null,null,null,null,null,null,null,null,null,null,null,null,null,null,null,null,null,null,null,null,null,null,null,null,null,null,null,null,null,null,null,null,null,{"$f":"COUNTIF($N$32,\"*(F)*\")>0","v":false},{"$f":"COUNTIF($N$32,\"*OCN光【光一括提供型】*\")>0","v":false},{"$f":"COUNTIF($BD$33,\"*hn*\")>0","v":true},{"$f":"$N$32=\"フレッツ・ISDN\"","v":false},{"$f":"$BD$33=\"forVPNhnc\"","v":false},{"$f":"COUNTIF($N$32,\"*IPoE*\")>0","v":true},{"$f":"$BD$33=\"dexhnc\"","v":false}]
[null,"※必ずチェックを入れてください。チェックがない場合はお申込みいただけません。"]
{"$rows_left_out":111}
{"sheet":"IPoE申込情報","index":3,"n_rows":35,"n_cols":59,"rows_kept":35,"cut":false,"hidden":false,"merged":[[2,0,2,51],[31,6,31,12],[33,0,33,51],[26,0,26,12],[27,0,27,12],[24,0,24,12],[20,0,20,12],[21,0,21,12],[21,13,21,32],[21,33,21,51],[25,0,25,12],[22,0,22,12],[23,0,23,12],[25,13,25,32],[25,33,25,51],[22,13,22,32],[34,0,34,12],[34,13,34,34],[34,35,34,51],[28,0,31,5],[28,6,28,12],[29,6,29,12],[29,13,29,41],[29,42,29,51],[30,6,30,12],[30,13,30,32],[30,33,30,51],[31,13,31,32],[31,33,31,51],[28,13,28,32],[28,33,28,51],[22,33,22,51],[23,13,23,32],[23,33,23,51],[24,13,24,32],[19,0,19,51],[24,33,24,51],[20,13,20,32],[20,33,20,51],[13,0,13,12],[13,13,13,32],[13,33,13,41],[13,42,13,51],[14,0,14,12],[14,13,14,32],[14,33,14,41],[14,42,14,51],[15,0,15,51],[16,0,16,12],[16,13,16,32],[16,33,16,51],[18,0,18,51],[11,0,11,12],[11,13,11,32],[11,33,11,41],[11,42,11,51],[12,0,12,12],[12,13,12,32],[12,33,12,41],[12,42,12,51],[9,0,9,12],[9,13,9,32],[9,33,9,41],[9,42,9,51],[10,0,10,12],[10,13,10,32],[10,33,10,41],[10,42,10,51],[7,0,7,12],[7,13,7,32],[7,33,7,41],[7,42,7,51],[8,0,8,12],[8,13,8,32],[8,33,8,41],[8,42,8,51],[4,0,4,51],[5,0,5,51],[6,0,6,12],[6,13,6,32],[6,33,6,41],[6,42,6,51],[26,13,26,32],[26,33,26,51],[27,13,27,20],[27,21,27,24],[27,25,27,32],[27,33,27,51]]}
[null,null,null,null,null,null,null,null,null,null,null,null,null,null,null,null,null,null,null,null,null,null,null,null,null,null,null,null,null,null,null,null,null,null,null,null,null,null,null,null,null,null,null,null,null,null,null,null,null,null,null,{"$f":"基本情報!$AZ$1","v":"Ver.1.02B(2020/11/30)"},null,null,null,null,"IPoEメニュー","アクセスタイプ：\n光コラボ"]
[null,null,null,null,null,null,null,null,null,null,null,null,null,null,null,null,null,null,null,null,null,null,null,null,null,null,null,null,null,null,null,null,null,null,null,null,null,null,null,null,null,null,null,null,null,null,null,null,null,null,null,null,null,null,null,null,{"$f":"基本情報!$BH$7","v":true},{"$f":"基本情報!$BD$7","v":false}]
[{"$f":"基本情報!$A$5","v":"第６種オープンコンピュータ通信網サービス　IP1/forVPN/動的IP　契約申込書（新規）"}]
[]
["フレッツ回線情報　　※フレッツ別契約型の場合のみご記入ください。"]
["■ご注意\n※ご利用中のフレッツ回線の情報をご記入ください。（NTT東西へフレッツ回線を申込みされた時にフレッツ申込書に記載した内容をお書きください。）\n※本サービスのお申し込みには、ご利用になるフレッツ契約IDおよびアクセスキー（又は、フレッツ契約IDおよびその名義等の情報）を記入いただく必要があります。\nフレッツ契約IDが未記入の場合は、お客さまからお預かりしたフレッツ名義等の情報を元にNTT東西から開示されるフレッツ契約IDを利用し開通工事を実施します。",null,null,null,null,null,null,null,null,null,null,null,null,null,null,null,null,null,null,null,null,null,null,null,null,null,null,null,null,null,null,null,null,null,null,null,null,null,null,null,null,null,null,null,null,null,null,null,null,null,null,null,null,null,null,null,"フレッツ回線情報\n入力要否\n※TRUEの時活性\n\n【条件付き書式】",{"$f":"IF(基本情報!$N$32=\"\",TRUE,IF(AND($BE$2<>FALSE,$BF$2<>TRUE),TRUE,FALSE))","v":true},"フレッツ別契かつIPoEの場合TRUE"]
["▼ご記入ください",null,null,null,null,null,null,null,null,null,null,null,null,"▼ご記入ください",null,null,null,null,null,null,null,null,null,null,null,null,null,null,null,null,null,null,null,"留意事項",null,null,null,null,null,null,null,null,"弊社記入欄（記入不要）"]
["フレッツ契約ID\n（必須）",null,null,null,null,null,null,null,null,null,null,null,null,null,null,null,null,null,null,null,null,null,null,null,null,null,null,null,null,null,null,null,null,"半角英数11桁 または 13桁\n※ご利用中（またはお申込み中）のフレッツ契約IDをご記入ください。\n※東日本：CAFまたはCOPから始まる番号\n※西日本：CAFから始まる番号"]
{"$rows_left_out":28}
{"sheet":"付加サービス情報","index":4,"n_rows":16,"n_cols":60,"rows_kept":16,"cut":false,"hidden":false,"merged":[[11,0,11,12],[11,33,11,51],[11,23,11,26],[11,27,11,32],[7,33,7,51],[7,13,7,32],[10,27,10,32],[10,23,10,26],[10,13,10,22],[15,13,15,32],[15,33,15,51],[12,0,12,12],[15,0,15,12],[14,0,14,12],[14,13,14,32],[14,33,14,51],[12,13,12,32],[12,33,12,51],[13,0,13,12],[4,0,4,51],[2,0,2,51],[5,0,5,51],[13,13,13,32],[13,33,13,51],[6,0,6,51],[10,0,10,12],[10,33,10,51],[11,13,11,22],[7,0,7,12],[8,0,8,12],[8,13,8,32],[8,33,8,51],[9,0,9,12],[9,13,9,32],[9,33,9,51]]}
[null,null,null,null,null,null,null,null,null,null,null,null,null,null,null,null,null,null,null,null,null,null,null,null,null,null,null,null,null,null,null,null,null,null,null,null,null,null,null,null,null,null,null,null,null,null,null,null,null,null,null,{"$f":"基本情報!$AZ$1","v":"Ver.1.02B(2020/11/30)"},null,null,"アクセスタイプ：(F)","アクセスタイプ：\n光コラボ","回線が光ネクスト","フレッツ・ISDN","forVPN/動的IP\nかつ光コラボ","IPoEメニュー"]
[null,null,null,null,null,null,null,null,null,null,null,null,null,null,null,null,null,null,null,null,null,null,null,null,null,null,null,null,null,null,null,null,null,null,null,null,null,null,null,null,null,null,null,null,null,null,null,null,null,null,null,null,null,null,{"$f":"基本情報!$BC$7","v":false},{"$f":"基本情報!$BD$7","v":false},{"$f":"基本情報!$BE$7","v":true},{"$f":"基本情報!$BF$7","v":false},{"$f":"基本情報!$BG$7","v":false},{"$f":"基本情報!$BH$7","v":true}]
[{"$f":"基本情報!A5","v":"第６種オープンコンピュータ通信網サービス　IP1/forVPN/動的IP　契約申込書（新規）"}]
[]
["付加サービス情報"]
["■ご注意\n※「ビジネスパックＶＰＮ」・「一元故障受付サービス」については、必ず営業担当者経由でお申込ください。\n※OCNビジネスパックＶＰＮは、Ｂフレッツビジネスタイプ「ひかり電話ビジネスタイプ対応、及び同ベーシックタイプ「ひかり電話ビジネスタイプ」対応とあわせてのご利用はできません。"]
[]
["OCN セキュリティゲートウェイ\n（ISDN除く）（必須）",null,null,null,null,null,null,null,null,null,null,null,null,null,null,null,null,null,null,null,null,null,null,null,null,null,null,null,null,null,null,null,null,"選択してください\n※利用する場合は、「OCNセキュリティゲートウェイ申込書」を合わせてお申込みください。\n・ルータタイプを利用する場合、OCNビジネスパックVPNとの併用はできません。\n・ブリッジタイプを利用する場合、OCNビジネスパックVPNとの併用が可能です。",null,null,null,null,null,null,null,null,null,null,null,null,null,null,null,null,null,null,null,null,"SGW\n【リスト】",{"$f":"IF(OR($N$9=\"利用する\",$BH$2=TRUE),\"list_SGW_2\",\"list_SGW_1\")","v":"list_SGW_2"},"SGW\n【条件付き書式】",{"$f":"IF($BF$2=TRUE,FALSE,TRUE)","v":true}]
{"$rows_left_out":9}
{"sheet":"OCNメールアカウント情報","index":5,"n_rows":37,"n_cols":56,"rows_kept":37,"cut":false,"hidden":false,"merged":[[23,0,24,5],[25,0,26,5],[11,33,13,51],[15,33,17,51],[19,33,21,51],[23,33,25,51],[23,6,23,12],[23,13,23,32],[24,6,24,12],[24,13,24,32],[25,6,25,12],[25,13,25,32],[17,13,17,32],[21,6,21,12],[21,13,21,32],[18,13,18,32],[33,0,34,5],[27,0,27,51],[28,0,28,51],[29,0,30,5],[26,6,26,12],[26,13,26,32],[26,33,26,51],[30,33,30,51],[30,6,30,12],[29,6,29,12],[31,0,32,5],[31,6,31,12],[31,13,31,32],[31,33,31,51],[32,6,32,12],[32,29,32,32],[35,0,36,5],[35,6,35,12],[35,13,35,32],[35,33,35,51],[36,6,36,12],[36,13,36,28],[36,33,36,51],[36,29,36,32],[33,6,33,12],[33,13,33,32],[33,33,33,51],[34,6,34,12],[34,13,34,28],[34,33,34,51],[34,29,34,32],[32,13,32,28],[32,33,32,51],[30,13,30,28],[30,29,30,32],[29,13,29,32],[29,33,29,51],[22,33,22,51],[19,0,20,5],[21,0,22,5],[15,13,15,32],[16,6,16,12],[16,13,16,32],[19,6,19,12],[19,13,19,32],[20,6,20,12],[20,13,20,32],[22,6,22,12],[22,13,22,32],[18,33,18,51],[11,0,12,5],[13,0,14,5],[15,0,16,5],[17,0,18,5],[11,13,11,32],[12,13,12,32],[14,13,14,32],[14,6,14,12],[12,6,12,12],[11,6,11,12],[15,6,15,12],[18,6,18,12],[13,6,13,12],[17,6,17,12],[14,33,14,51],[13,13,13,32],[2,0,2,51],[4,0,4,51],[10,0,10,51],[9,0,9,51],[5,0,5,12],[5,13,5,32],[5,33,5,51],[6,0,6,12],[6,13,6,32],[6,33,6,51],[7,0,7,12],[7,13,7,32],[7,33,7,51],[8,0,8,51]]}
[null,null,null,null,null,null,null,null,null,null,null,null,null,null,null,null,null,null,null,null,null,null,null,null,null,null,null,null,null,null,null,null,null,null,null,null,null,null,null,null,null,null,null,null,null,null,null,null,null,null,null,{"$f":"基本情報!$AZ$1","v":"Ver.1.02B(2020/11/30)"}]
[]
[{"$f":"基本情報!A5","v":"第６種オープンコンピュータ通信網サービス　IP1/forVPN/動的IP　契約申込書（新規）"}]
[]
["OCNメールアカウント情報"]
["メールアカウント希望有無（必須）",null,null,null,null,null,null,null,null,null,null,null,null,null,null,null,null,null,null,null,null,null,null,null,null,null,null,null,null,null,null,null,null,"選択してください"]
["オプション(メールアドレス追加)同時申込\n（希望する）（必須）",null,null,null,null,null,null,null,null,null,null,null,null,null,null,null,null,null,null,null,null,null,null,null,null,null,null,null,null,null,null,null,null,"選択してください\n※有料となります。",null,null,null,null,null,null,null,null,null,null,null,null,null,null,null,null,null,null,null,null,"オプション(メールアドレス追加)同時申込\n【条件付き書式】",{"$f":"$N$6<>\"希望しない\"","v":true}]
["メールアドレス引継ぎ希望有無（必須）",null,null,null,null,null,null,null,null,null,null,null,null,null,null,null,null,null,null,null,null,null,null,null,null,null,null,null,null,null,null,null,null,"選択してください"]
{"$rows_left_out":30}
{"sheet":"list","index":6,"n_rows":261,"n_cols":6,"rows_kept":261,"cut":false,"hidden":true,"merged":[[5,2,15,2]]}
[]
[null,"項目名","条件等","リスト値","名前定義"]
[null,"IP種別","-","forVPN/動的IP","list_Ipaddress"]
[null,null,null,"動的IP(ex)"]
[null,null,null,"IP1"]
[null,"アクセスタイプ","forVPN/動的IP\nIP1\n","フレッツ 光ネクスト(IPoE 標準プラン)","list_AL_1"]
[null,null,null,"フレッツ 光ネクスト(IPoE ワイドプラン)"]
[null,null,null,"フレッツ 光ネクスト"]
{"$rows_left_out":254}
{"sheet":"変換","index":7,"n_rows":77,"n_cols":11,"rows_kept":77,"cut":false,"hidden":true,"merged":[]}
[null,"▼契約タイプ制御用",null,null,null,"▼管理者連絡窓口情報、技術連絡担当者情報（英文：部署/所属）",null,null,null,"▼管理者連絡窓口情報、技術連絡担当者情報（英文：肩書）"]
[null,"IP種別＋アクセスタイプ","変換用",null,null,"部署和文","部署英文",null,null,"肩書和文","肩書英文"]
[null,"forVPN/動的IPフレッツ 光ネクスト(IPoE 標準プラン)","forVPNhnIPoE",null,null,"総務部","General affairs department",null,null,"代表取締役会長","Chairperson & C.E.O"]
[null,"forVPN/動的IPフレッツ 光ネクスト(IPoE ワイドプラン)","forVPNhnIPoE",null,null,"企画部","Planning department",null,null,"会長","Chairperson"]
[null,"forVPN/動的IPフレッツ 光ネクスト","forVPNhn",null,null,"営業部","The sales department",null,null,"代表取締役社長","C.E.O"]
[null,"forVPN/動的IPフレッツ 光ライト","forVPNhl",null,null,"開発部","The development department",null,null,"社長","President"]
[null,"forVPN/動的IPフレッツ・光プレミアム(NTT西日本)","forVPNhp",null,null,"総務課","General affairs department",null,null,"代表取締役","C.E.O"]
[null,"forVPN/動的IPBフレッツ","forVPNB",null,null,"営業課","Business department",null,null,"専務取締役","Executive Vice President"]
{"$rows_left_out":70}
{"sheet":"OCNメニュー","index":8,"n_rows":408,"n_cols":7,"rows_kept":408,"cut":false,"hidden":true,"merged":[]}
["■OCN提供メニュー/OCN認証ドメイン"]
[null,"IP種別","アクセスタイプ","契約タイプ","IP種別＋アクセスタイプ＋契約タイプの合体名（検索値）","OCN提供メニュー","OCN認証ドメイン"]
[null,"forVPN/動的IP","フレッツ・ADSL","1.5Mタイプ",{"$f":"B3&C3&D3","v":"forVPN/動的IPフレッツ・ADSL1.5Mタイプ"},"OCN ADSLアクセス 「フレッツ」プラン forVPN 1M/1.5M/8M/12M/24M/40M/47Mタイプ","xxx@dfa.ocn.ne.jp"]
[null,"forVPN/動的IP","フレッツ・ADSL","8Mタイプ",{"$f":"B4&C4&D4","v":"forVPN/動的IPフレッツ・ADSL8Mタイプ"},"OCN ADSLアクセス 「フレッツ」プラン forVPN 1M/1.5M/8M/12M/24M/40M/47Mタイプ","xxx@dfa.ocn.ne.jp"]
[null,"forVPN/動的IP","フレッツ・ADSL","モア(12M)","forVPN/動的IPフレッツ・ADSLモア(12M)","OCN ADSLアクセス 「フレッツ」プラン forVPN 1M/1.5M/8M/12M/24M/40M/47Mタイプ","xxx@dfa.ocn.ne.jp"]
[null,"forVPN/動的IP","フレッツ・ADSL","モアⅡ(24Mタイプ)/モア24(24タイプ)","forVPN/動的IPフレッツ・ADSLモアⅡ(24Mタイプ)/モア24(24タイプ)","OCN ADSLアクセス 「フレッツ」プラン forVPN 1M/1.5M/8M/12M/24M/40M/47Mタイプ","xxx@dfa.ocn.ne.jp"]
[null,"forVPN/動的IP","フレッツ・ADSL","モアⅡ(40M)/モア40(40Mタイプ)","forVPN/動的IPフレッツ・ADSLモアⅡ(40M)/モア40(40Mタイプ)","OCN ADSLアクセス 「フレッツ」プラン forVPN 1M/1.5M/8M/12M/24M/40M/47Mタイプ","xxx@dfa.ocn.ne.jp"]
[null,"forVPN/動的IP","フレッツ・ADSL","モアⅢ(47M)・モアスペシャル(47M)","forVPN/動的IPフレッツ・ADSLモアⅢ(47M)・モアスペシャル(47M)","OCN ADSLアクセス 「フレッツ」プラン forVPN 1M/1.5M/8M/12M/24M/40M/47Mタイプ","xxx@dfa.ocn.ne.jp"]
{"$rows_left_out":401}
{"sheet":"改版履歴","index":9,"n_rows":32,"n_cols":9,"rows_kept":32,"cut":false,"hidden":true,"merged":[]}
["改版履歴"]
[null,"No.","更新日","更新者","Ver.","シート名","概要","詳細","備考"]
[null,1,"2020-03-18","石田香織","Ver.1.00A","-","初版",null,"Webエントリリリース：2020/3/18"]
[null,2,"2020-04-22","石田香織","Ver.1.00B","留意事項","留意事項シート追加","留意事項を最新化し、シート追加"]
[null,3,"2020-04-22","石田香織","Ver.1.00B","基本情報\n付加サービス情報","\"（必須）\"表記の追加","条件付きにて必須となる項目について、項目名横に\"（必須）\"の表記が漏れている箇所があったため追記"]
[null,4,"2020-05-14","石田香織","Ver.1.00C","付加サービス情報","セキュリティゲートウェイのプルダウン値の制御修正","アクセスタイプがIPoEの時、「利用する(ルータタイプ)」を非表示とするよう条件追加"]
[null,5,"2020-05-20","石田香織","Ver.1.00D","IPoE申込情報","端末開放フラグの値修正","端末開放フラグのプルダウン値を「1」のみへ修正\n※端末開放の標準化に伴う対応","Webエントリリリース：2020/6/12予定\n※SO-infoは6/1より掲載"]
[null,6,"2020-06-15","石田香織","Ver.1.00E","基本情報","「アクセス回線充当有無」の条件付き書式修正","フレッツ別契約型かつIPoEメニューの場合のみ活性となるよう条件付き書式を修正"]
{"$rows_left_out":24}